Reaction Details
TargetRho-associated protein kinase 1
LigandBDBM50324592
Substrate/Competitorn/a
Meas. Tech.ChEMBL_649557 (CHEMBL1219255)
IC50 16±n/a nM
Citation Fang, XYin, YChen, YTYao, LWang, BCameron, MDLin, LKhan, SRuiz, CSchröter, TGrant, WWeiser, APocas, JPachori, ASchürer, SLograsso, PFeng, Y Tetrahydroisoquinoline derivatives as highly selective and potent Rho kinase inhibitors. J Med Chem53:5727-37 (2010) 
 
Rho-associated protein kinase 1
Name:Rho-associated protein kinase 1
Type:Serine/threonine-protein kinase
Mol. Mass.:158156.77
Organism:Homo sapiens (Human)
Description:Q13464
Residue:1354
BDBM50324592
NameBDBM50324592
Synonyms:(R)-N-(2-(2-(Dimethylamino)ethoxy)-5-fluoro-4-(1H-pyrazol-4-yl)phenyl)-2-ethyl-1,2,3,4-tetra-hydroisoquinoline-3-carboxamide | CHEMBL1215526
TypeSmall organic molecule
Emp. Form.C25H30FN5O2
Mol. Mass.451.5364
SMILESCCN1Cc2ccccc2C[C@@H]1C(=O)Nc1cc(F)c(cc1OCCN(C)C)-c1cn[nH]c1