Reaction Details
TargetMitogen-activated protein kinase 10
LigandBDBM50324575
Substrate/Competitorn/a
Meas. Tech.ChEMBL_649559 (CHEMBL1219257)
IC50>20000±n/a nM
Citation Fang, XYin, YChen, YTYao, LWang, BCameron, MDLin, LKhan, SRuiz, CSchröter, TGrant, WWeiser, APocas, JPachori, ASchürer, SLograsso, PFeng, Y Tetrahydroisoquinoline derivatives as highly selective and potent Rho kinase inhibitors. J Med Chem53:5727-37 (2010) 
 
Mitogen-activated protein kinase 10
Name:Mitogen-activated protein kinase 10
Type:Enzyme
Mol. Mass.:52586.89
Organism:Homo sapiens (Human)
Description:n/a
Residue:464
BDBM50324575
NameBDBM50324575
Synonyms:(R)-N-(2-(2-(Dimethylamino)ethoxy)-4-(1H-pyrazol-4-yl)-phenyl)-6-methoxy-1,2,3,4-tetrahydro-isoquinoline-3-carboxamide | CHEMBL1215171
TypeSmall organic molecule
Emp. Form.C24H29N5O3
Mol. Mass.435.5188
SMILESCOc1ccc2CN[C@H](Cc2c1)C(=O)Nc1ccc(cc1OCCN(C)C)-c1cn[nH]c1