Reaction Details
TargetP-selectin glycoprotein ligand 1
LigandBDBM50324664
Substrate/Competitorn/a
Meas. Tech.ChEMBL_649756 (CHEMBL1219454)
IC50 250000±n/a nM
Citation Huang, AMoretto, AJanz, KLowe, MBedard, PWTam, SDi, LClerin, VSushkova, NTchernychev, BTsao, DHKeith, JCShaw, GDSchaub, RGWang, QKaila, N Discovery of 2-[1-(4-chlorophenyl)cyclopropyl]-3-hydroxy-8-(trifluoromethyl)quinoline-4-carboxylic acid (PSI-421), a P-selectin inhibitor with improved pharmacokinetic properties and oral efficacy in models of vascular injury. J Med Chem53:6003-17 (2010) 
 
P-selectin glycoprotein ligand 1
Name:P-selectin glycoprotein ligand 1
Type:PROTEIN
Mol. Mass.:43174.76
Organism:Homo sapiens (Human)
Description:ChEMBL_649756
Residue:412
BDBM50324664
NameBDBM50324664
Synonyms:3-Hydroxy-2-(1-phenylcyclopropyl)-7,8,9,10-tetrahydrobenzo-[h]quinoline-4-carboxylic Acid | CHEMBL1215806
TypeSmall organic molecule
Emp. Form.C23H21NO3
Mol. Mass.359.4177
SMILESOC(=O)c1c(O)c(nc2c3CCCCc3ccc12)C1(CC1)c1ccccc1