Reaction Details
TargetMonocarboxylate transporter 1
LigandBDBM22002
Substrate/Competitorn/a
Meas. Tech.ChEMBL_653482 (CHEMBL1226685)
Ki 0.354813±n/a nM
Citation Murray, CMHutchinson, RBantick, JRBelfield, GPBenjamin, ADBrazma, DBundick, RVCook, IDCraggs, RIEdwards, SEvans, LRHarrison, RHolness, EJackson, APJackson, CGKingston, LPPerry, MWRoss, ARRugman, PASidhu, SSSullivan, MTaylor-Fishwick, DAWalker, PCWhitehead, YMWilkinson, DJWright, ADonald, DK Monocarboxylate transporter MCT1 is a target for immunosuppression. Nat Chem Biol1:371-6 (2005) Monocarboxylate transporter 1
Name:Monocarboxylate transporter 1
Type:PROTEIN
Mol. Mass.:53956.64
Organism:Homo sapiens (Human)
Description:ChEMBL_1451367
Residue:500
BDBM22002
NameBDBM22002
Synonyms:5-[(3-hydroxypropyl)sulfanyl]-3-methyl-1-(2-methylpropyl)-6-{[2-(trifluoromethyl)phenyl]methyl}-1H,2H,3H,4H-thieno[2,3-d]pyrimidine-2,4-dione | Thieno[2,3-d]pyrimidine-2,4(1H,3H)-dione, 4
TypeSmall organic molecule
Emp. Form.C22H25F3N2O3S2
Mol. Mass.486.571
SMILESCC(C)Cn1c2sc(Cc3ccccc3C(F)(F)F)c(SCCCO)c2c(=O)n(C)c1=O