Reaction Details
TargetMonocarboxylate transporter 1
LigandBDBM22017
Substrate/Competitorn/a
Meas. Tech.ChEMBL_653483 (CHEMBL1226686)
Ki 5.6±n/a nM
Citation Murray, CMHutchinson, RBantick, JRBelfield, GPBenjamin, ADBrazma, DBundick, RVCook, IDCraggs, RIEdwards, SEvans, LRHarrison, RHolness, EJackson, APJackson, CGKingston, LPPerry, MWRoss, ARRugman, PASidhu, SSSullivan, MTaylor-Fishwick, DAWalker, PCWhitehead, YMWilkinson, DJWright, ADonald, DK Monocarboxylate transporter MCT1 is a target for immunosuppression. Nat Chem Biol1:371-6 (2005) Monocarboxylate transporter 1
Name:Monocarboxylate transporter 1
Type:PROTEIN
Mol. Mass.:53956.64
Organism:Homo sapiens (Human)
Description:ChEMBL_1451367
Residue:500
BDBM22017
NameBDBM22017
Synonyms:3-methyl-1-(2-methylpropyl)-5-(pyrrolidin-1-ylcarbonyl)-6-{[2-(trifluoromethyl)phenyl]methyl}-1H,2H,3H,4H-thieno[2,3-d]pyrimidine-2,4-dione | Thieno[2,3-d]pyrimidine-2,4(1H,3H)-dione, 24
TypeSmall organic molecule
Emp. Form.C24H26F3N3O3S
Mol. Mass.493.542
SMILESCC(C)Cn1c2sc(Cc3ccccc3C(F)(F)F)c(C(=O)N3CCCC3)c2c(=O)n(C)c1=O