Reaction Details
TargetMonocarboxylate transporter 1
LigandBDBM50031739
Substrate/Competitorn/a
Meas. Tech.ChEMBL_653482 (CHEMBL1226685)
Ki 15±n/a nM
Citation Murray, CMHutchinson, RBantick, JRBelfield, GPBenjamin, ADBrazma, DBundick, RVCook, IDCraggs, RIEdwards, SEvans, LRHarrison, RHolness, EJackson, APJackson, CGKingston, LPPerry, MWRoss, ARRugman, PASidhu, SSSullivan, MTaylor-Fishwick, DAWalker, PCWhitehead, YMWilkinson, DJWright, ADonald, DK Monocarboxylate transporter MCT1 is a target for immunosuppression. Nat Chem Biol1:371-6 (2005) Monocarboxylate transporter 1
Name:Monocarboxylate transporter 1
Type:PROTEIN
Mol. Mass.:53956.64
Organism:Homo sapiens (Human)
Description:ChEMBL_1451367
Residue:500
BDBM50031739
NameBDBM50031739
Synonyms:1-Isobutyl-3-methyl-6-naphthalen-1-ylmethyl-1,6-dihydro-pyrrolo[3,4-d]pyrimidine-2,4-dione CHEMBL315970
TypeSmall organic molecule
Emp. Form.C22H23N3O2
Mol. Mass.361.4369
SMILESCC(C)Cn1c2cn(Cc3cccc4ccccc34)cc2c(=O)n(C)c1=O