Reaction Details
TargetMonocarboxylate transporter 1
LigandBDBM50416572
Substrate/Competitorn/a
Meas. Tech.ChEMBL_653483 (CHEMBL1226686)
Ki<200±n/a nM
Citation Murray, CMHutchinson, RBantick, JRBelfield, GPBenjamin, ADBrazma, DBundick, RVCook, IDCraggs, RIEdwards, SEvans, LRHarrison, RHolness, EJackson, APJackson, CGKingston, LPPerry, MWRoss, ARRugman, PASidhu, SSSullivan, MTaylor-Fishwick, DAWalker, PCWhitehead, YMWilkinson, DJWright, ADonald, DK Monocarboxylate transporter MCT1 is a target for immunosuppression. Nat Chem Biol1:371-6 (2005) Monocarboxylate transporter 1
Name:Monocarboxylate transporter 1
Type:PROTEIN
Mol. Mass.:53956.64
Organism:Homo sapiens (Human)
Description:ChEMBL_1451367
Residue:500
BDBM50416572
NameBDBM50416572
Synonyms:CHEMBL1221510
TypeSmall organic molecule
Emp. Form.C22H22F3N3O3S
Mol. Mass.465.489
SMILESCC(C)Cn1c2sc(Cc3ccccc3C(F)(F)F)c(C(=O)N3CCC3)c2c(=O)[nH]c1=O