Reaction Details
TargetG-protein coupled estrogen receptor 1
LigandBDBM50303803
Substrate/Competitorn/a
Meas. Tech.ChEMBL_653105 (CHEMBL1226308)
Ki 11±n/a nM
Citation Bologa, CGRevankar, CMYoung, SMEdwards, BSArterburn, JBKiselyov, ASParker, MATkachenko, SESavchuck, NPSklar, LAOprea, TIProssnitz, ER Virtual and biomolecular screening converge on a selective agonist for GPR30. Nat Chem Biol2:207-12 (2006) 
 
G-protein coupled estrogen receptor 1
Name:G-protein coupled estrogen receptor 1
Type:PROTEIN
Mol. Mass.:42259.21
Organism:Homo sapiens (Human)
Description:ChEMBL_982507
Residue:375
BDBM50303803
NameBDBM50303803
Synonyms:1-((3aS,4R,9bR)-4-(6-bromobenzo[d][1,3]dioxol-5-yl)-3a,4,5,9b-tetrahydro-3H-cyclopenta[c]quinolin-8-yl)ethanone cid_3136849 | cid_5322399
TypeSmall organic molecule
Emp. Form.C21H18BrNO3
Mol. Mass.412.277
SMILESCC(=O)c1ccc2N[C@H]([C@H]3CC=C[C@H]3c2c1)c1cc2OCOc2cc1Br