Reaction Details
TargetVascular endothelial growth factor receptor 2
LigandBDBM4851
Substrate/Competitorn/a
Meas. Tech.ChEMBL_653323 (CHEMBL1226526)
IC50 42±n/a nM
Citation Bayliss, PEBellavance, KLWhitehead, GGAbrams, JMAegerter, SRobbins, HSCowan, DBKeating, MTO'Reilly, TWood, JMRoberts, TMChan, J Chemical modulation of receptor signaling inhibits regenerative angiogenesis in adult zebrafish. Nat Chem Biol2:265-73 (2006) 
 
Vascular endothelial growth factor receptor 2
Name:Vascular endothelial growth factor receptor 2
Type:Receptor Tyrosine Kinase
Mol. Mass.:151510.97
Organism:Homo sapiens (Human)
Description:P35968
Residue:1356
BDBM4851
NameBDBM4851
Synonyms:(4-chlorophenyl)-[4-(4-pyridylmethyl)phthalazin-1-yl]amine CGP 79787 CHEMBL75232 N-(4-chlorophenyl)-4-(pyridin-4-ylmethyl)phthalazin-1-amine PTK787 cid_151194
TypeSmall organic molecule
Emp. Form.C20H15ClN4
Mol. Mass.346.813
SMILESClc1ccc(Nc2nnc(Cc3ccncc3)c3ccccc23)cc1