Reaction Details
TargetProto-oncogene tyrosine-protein kinase Src
LigandBDBM4567
Substrate/Competitorn/a
Meas. Tech.ChEMBL_652997 (CHEMBL1226200)
IC50>27000±n/a nM
Citation Blair, JARauh, DKung, CYun, CHFan, QWRode, HZhang, CEck, MJWeiss, WAShokat, KM Structure-guided development of affinity probes for tyrosine kinases using chemical genetics. Nat Chem Biol3:229-38 (2007) 
 
Proto-oncogene tyrosine-protein kinase Src
Name:Proto-oncogene tyrosine-protein kinase Src
Type:Protein
Mol. Mass.:59838.60
Organism:Homo sapiens (Human)
Description:P12931
Residue:536
BDBM4567
NameBDBM4567
Synonyms:4-anilinoquinazoline deriv. 2 CHEMBL285063 US9422297, PD168393
TypeSmall organic molecule
Emp. Form.C17H13BrN4O
Mol. Mass.369.215
SMILESBrc1cccc(Nc2ncnc3ccc(NC(=O)C=C)cc23)c1