Reaction Details
TargetCannabinoid receptor 1
LigandBDBM50132717
Substrate/Competitorn/a
Meas. Tech.ChEMBL_653422 (CHEMBL1226625)
IC50 2±n/a nM
Citation Nomura, DKBlankman, JLSimon, GMFujioka, KIssa, RSWard, AMCravatt, BFCasida, JE Activation of the endocannabinoid system by organophosphorus nerve agents. Nat Chem Biol4:373-8 (2008) 
 
Cannabinoid receptor 1
Name:Cannabinoid receptor 1
Type:Enzyme
Mol. Mass.:52842.52
Organism:Mus musculus (Mouse)
Description:P47746
Residue:473
BDBM50132717
NameBDBM50132717
Synonyms:CHEMBL333149 isopropyl dodecylphosphonofluoridate | isopropyl dodecylphosphonofluoridoate
TypeSmall organic molecule
Emp. Form.C15H32FO2P
Mol. Mass.294.3855
SMILESCCCCCCCCCCCCP(F)(=O)OC(C)C