Reaction Details
TargetFatty-acid amide hydrolase 1
LigandBDBM50247086
Substrate/Competitorn/a
Meas. Tech.ChEMBL_653616 (CHEMBL1226988)
IC50 460±n/a nM
Citation Nomura, DKBlankman, JLSimon, GMFujioka, KIssa, RSWard, AMCravatt, BFCasida, JE Activation of the endocannabinoid system by organophosphorus nerve agents. Nat Chem Biol4:373-8 (2008) 
 
Fatty-acid amide hydrolase 1
Name:Fatty-acid amide hydrolase 1
Type:Hydrolase; single-pass membrane protein; homodimer
Mol. Mass.:63227.28
Organism:Mus musculus (mouse)
Description:Mouse brain membranes were used in the assay.
Residue:579
BDBM50247086
NameBDBM50247086
Synonyms:CHEMBL444970 diethyl 3,5,6-trichloropyridin-2-yl phosphate
TypeSmall organic molecule
Emp. Form.C9H11Cl3NO4P
Mol. Mass.334.521
SMILESCCOP(=O)(OCC)Oc1nc(Cl)c(Cl)cc1Cl