Reaction Details
TargetAcetylcholinesterase
LigandBDBM50132717
Substrate/Competitorn/a
Meas. Tech.ChEMBL_653619 (CHEMBL1226991)
IC50 6300±n/a nM
Citation Nomura, DKBlankman, JLSimon, GMFujioka, KIssa, RSWard, AMCravatt, BFCasida, JE Activation of the endocannabinoid system by organophosphorus nerve agents. Nat Chem Biol4:373-8 (2008) 
 
Acetylcholinesterase
Name:Acetylcholinesterase
Type:Enzyme
Mol. Mass.:68165.65
Organism:Mus musculus (mouse)
Description:n/a
Residue:614
BDBM50132717
NameBDBM50132717
Synonyms:CHEMBL333149 isopropyl dodecylphosphonofluoridate | isopropyl dodecylphosphonofluoridoate
TypeSmall organic molecule
Emp. Form.C15H32FO2P
Mol. Mass.294.3855
SMILESCCCCCCCCCCCCP(F)(=O)OC(C)C