Reaction Details
TargetAcetylcholinesterase
LigandBDBM50324698
Substrate/Competitorn/a
Meas. Tech.ChEMBL_653619 (CHEMBL1226991)
IC50 120±n/a nM
Citation Nomura, DKBlankman, JLSimon, GMFujioka, KIssa, RSWard, AMCravatt, BFCasida, JE Activation of the endocannabinoid system by organophosphorus nerve agents. Nat Chem Biol4:373-8 (2008) 
 
Acetylcholinesterase
Name:Acetylcholinesterase
Type:Enzyme
Mol. Mass.:68165.65
Organism:Mus musculus (mouse)
Description:n/a
Residue:614
BDBM50324698
NameBDBM50324698
Synonyms:CHEMBL1222256 | Ethyl octylfluorophosphonate
TypeSmall organic molecule
Emp. Form.C11H24FO2P
Mol. Mass.238.2792
SMILESCCCCCCCCP(F)(=O)OC(C)C