Reaction Details
TargetNAD-dependent protein deacetylase sirtuin-2
LigandBDBM50228363
Substrate/Competitorn/a
Meas. Tech.ChEMBL_650712 (CHEMBL1227292)
EC50 160±n/a nM
Citation Cole, PA Chemical probes for histone-modifying enzymes. Nat Chem Biol4:590-7 (2008) 
 
NAD-dependent protein deacetylase sirtuin-2
Name:NAD-dependent protein deacetylase sirtuin-2
Type:Hydrolase
Mol. Mass.:43172.62
Organism:Homo sapiens (Human)
Description:n/a
Residue:389
BDBM50228363
NameBDBM50228363
Synonyms:CHEMBL257991 SRT-1720
TypeSmall organic molecule
Emp. Form.C25H23N7OS
Mol. Mass.469.561
SMILESO=C(Nc1ccccc1-c1cn2c(CN3CCNCC3)csc2n1)c1cnc2ccccc2n1