Reaction Details
TargetFatty-acid amide hydrolase 1
LigandBDBM60622
Substrate/Competitorn/a
Meas. Tech.ChEMBL_650759 (CHEMBL1227519)
IC50 4±n/a nM
Citation Long, JZLi, WBooker, LBurston, JJKinsey, SGSchlosburg, JEPavón, FJSerrano, AMSelley, DEParsons, LHLichtman, AHCravatt, BF Selective blockade of 2-arachidonoylglycerol hydrolysis produces cannabinoid behavioral effects. Nat Chem Biol5:37-44 (2008) 
 
Fatty-acid amide hydrolase 1
Name:Fatty-acid amide hydrolase 1
Type:Protein
Mol. Mass.:63071.19
Organism:Homo sapiens (Human)
Description:O00519
Residue:579
BDBM60622
NameBDBM60622
Synonyms:BDBM50300355 US9133148, A
Typen/a
Emp. Form.C27H24N2O9
Mol. Mass.520.4875
SMILESOC(C1CCN(CC1)C(=O)Oc1ccc(cc1)[N+]([O-])=O)(c1ccc2OCOc2c1)c1ccc2OCOc2c1