Reaction Details
TargetCoagulation factor X
LigandBDBM50324788
Substrate/Competitorn/a
Meas. Tech.ChEMBL_651359 (CHEMBL1227179)
Ki 42±n/a nM
Citation Anselm, LBanner, DWBenz, JZbinden, KGHimber, JHilpert, HHuber, WKuhn, BMary, JLOtteneder, MBPanday, NRicklin, FStahl, MThomi, SHaap, W Discovery of a factor Xa inhibitor (3R,4R)-1-(2,2-difluoro-ethyl)-pyrrolidine-3,4-dicarboxylic acid 3-[(5-chloro-pyridin-2-yl)-amide] 4-[[2-fluoro-4-(2-oxo-2H-pyridin-1-yl)-phenyl]-amide] as a clinical candidate. Bioorg Med Chem Lett20:5313-9 (2010) 
 
Coagulation factor X
Name:Coagulation factor X
Type:Enzyme
Mol. Mass.:54726.60
Organism:Homo sapiens (Human)
Description:n/a
Residue:488
BDBM50324788
NameBDBM50324788
Synonyms:(3R,4R)-N3-(4-chlorophenyl)-1-(methylsulfonyl)-N4-(5-(2-(methylsulfonyl)phenyl)pyridin-2-yl)pyrrolidine-3,4-dicarboxamide | CHEMBL1222342
TypeSmall organic molecule
Emp. Form.C25H25ClN4O6S2
Mol. Mass.577.072
SMILESCS(=O)(=O)N1C[C@@H]([C@H](C1)C(=O)Nc1ccc(cn1)-c1ccccc1S(C)(=O)=O)C(=O)Nc1ccc(Cl)cc1