Reaction Details
TargetHomeodomain-interacting protein kinase 1
LigandBDBM50324797
Substrate/Competitorn/a
Meas. Tech.ChEMBL_651407 (CHEMBL1227380)
IC50>100000±n/a nM
Citation Giraud, FMarchand, PCarbonnelle, DSartor, MLang, FDuflos, M Synthesis of N-aryl-3-(indol-3-yl)propanamides and their immunosuppressive activities. Bioorg Med Chem Lett20:5203-6 (2010) 
 
Homeodomain-interacting protein kinase 1
Name:Homeodomain-interacting protein kinase 1
Type:PROTEIN
Mol. Mass.:130868.34
Organism:Homo sapiens (Human)
Description:ChEMBL_1459267
Residue:1210
BDBM50324797
NameBDBM50324797
Synonyms:3-(1-(4-chlorobenzyl)-1H-indol-3-yl)-N-(pyridin-4-yl)propanamide CHEMBL185140 | N-(pyridin-4-yl)-3-[1-(4-chlorobenzyl)indol-3-yl]-propanamide
TypeSmall organic molecule
Emp. Form.C23H20ClN3O
Mol. Mass.389.877
SMILESClc1ccc(Cn2cc(CCC(=O)Nc3ccncc3)c3ccccc23)cc1