Reaction Details
TargetIntegrin beta-2/Intercellular adhesion molecule 1
LigandBDBM50324811
Substrate/Competitorn/a
Meas. Tech.ChEMBL_651428 (CHEMBL1227401)
IC50 66±n/a nM
Citation Zhong, MShen, WBarr, KJArbitrario, JPArkin, MRBui, MChen, TCunningham, BCEvanchik, MJHanan, EJHoch, UHuen, KHyde, JKumer, JLLac, TLawrence, CEMartell, JROslob, JDPaulvannan, KPrabhu, SSilverman, JAWright, JYu, CHZhu, JFlanagan, WM Discovery of tetrahydroisoquinoline (THIQ) derivatives as potent and orally bioavailable LFA-1/ICAM-1 antagonists. Bioorg Med Chem Lett20:5269-73 (2010) 
 
Integrin beta-2/Intercellular adhesion molecule 1
Name:Integrin beta-2/Intercellular adhesion molecule 1
Synonyms:Intercellular adhesion molecule-1 /Leukocyte adhesion glycoprotein LFA-1 alpha
Type:n/a
Mol. Mass.:n/a
Description:ASSAY_ID of EBI is 651428
Components:This complex has 2 components.
Component 1
Name:Integrin beta-2
Type:PROTEIN
Mol. Mass.:84785.60
Organism:Homo sapiens (Human)
Description:EBI_12662
Residue:769
Component 2
Name:Intercellular adhesion molecule 1
Synonyms:CD_antigen=CD54 ICAM1 Intercellular adhesion molecule (ICAM-1), Integrin alpha-L/beta-2 Intercellular adhesion molecule-1 | Major group rhinovirus receptor
Type:PROTEIN
Mol. Mass.:57831.10
Organism:Homo sapiens (Human)
Description:ChEMBL_826675
Residue:532
BDBM50324811
NameBDBM50324811
Synonyms:(S)-2-(5,7-dichloro-2-(3-chlorobenzoyl)-1,2,3,4-tetrahydroisoquinoline-6-carboxamido)-3-(thiophene-2-carboxamido)propanoic acid | CHEMBL1222021
TypeSmall organic molecule
Emp. Form.C25H20Cl3N3O5S
Mol. Mass.580.867
SMILESOC(=O)[C@H](CNC(=O)c1cccs1)NC(=O)c1c(Cl)cc2CN(CCc2c1Cl)C(=O)c1cccc(Cl)c1