Reaction Details
TargetIntegrin alpha-L
LigandBDBM50324817
Substrate/Competitorn/a
Meas. Tech.ChEMBL_651442 (CHEMBL1227415)
IC50 3800±n/a nM
Citation Zhong, MShen, WBarr, KJArbitrario, JPArkin, MRBui, MChen, TCunningham, BCEvanchik, MJHanan, EJHoch, UHuen, KHyde, JKumer, JLLac, TLawrence, CEMartell, JROslob, JDPaulvannan, KPrabhu, SSilverman, JAWright, JYu, CHZhu, JFlanagan, WM Discovery of tetrahydroisoquinoline (THIQ) derivatives as potent and orally bioavailable LFA-1/ICAM-1 antagonists. Bioorg Med Chem Lett20:5269-73 (2010) 
 
Integrin alpha-L
Name:Integrin alpha-L
Type:PROTEIN
Mol. Mass.:128748.90
Organism:Homo sapiens (Human)
Description:ChEMBL_629045
Residue:1170
BDBM50324817
NameBDBM50324817
Synonyms:(S)-2-(5,7-dichloro-2-(4-chlorobenzoyl)-1,2,3,4-tetrahydroisoquinoline-6-carboxamido)-3-(furan-2-carboxamido)propanoic acid | CHEMBL1222133
TypeSmall organic molecule
Emp. Form.C25H20Cl3N3O6
Mol. Mass.564.802
SMILESOC(=O)[C@H](CNC(=O)c1ccco1)NC(=O)c1c(Cl)cc2CN(CCc2c1Cl)C(=O)c1ccc(Cl)cc1