Reaction Details
TargetBeta-2 adrenergic receptor
LigandBDBM50324840
Substrate/Competitorn/a
Meas. Tech.ChEMBL_651475 (CHEMBL1227592)
Ki 1±n/a nM
Citation Beattie, DBradley, MBrearley, ACharlton, SJCuenoud, BMFairhurst, RAGedeck, PGosling, MJanus, DJones, DLewis, CMcCarthy, COakman, HStringer, RTaylor, RJTuffnell, A A physical properties based approach for the exploration of a 4-hydroxybenzothiazolone series of beta2-adrenoceptor agonists as inhaled long-acting bronchodilators. Bioorg Med Chem Lett20:5302-7 (2010) 
 
Beta-2 adrenergic receptor
Name:Beta-2 adrenergic receptor
Type:n/a
Mol. Mass.:46461.69
Organism:Homo sapiens (Human)
Description:P07550
Residue:413
BDBM50324840
NameBDBM50324840
Synonyms:7-((R)-2-((R)-1-cyclohexylethylamino)-1-hydroxyethyl)-4-hydroxybenzo[d]thiazol-2(3H)-one | CHEMBL1221541
TypeSmall organic molecule
Emp. Form.C17H24N2O3S
Mol. Mass.336.449
SMILESC[C@@H](NC[C@H](O)c1ccc(O)c2[nH]c(=O)sc12)C1CCCCC1