Reaction Details
TargetBeta-2 adrenergic receptor
LigandBDBM50324844
Substrate/Competitorn/a
Meas. Tech.ChEMBL_651475 (CHEMBL1227592)
Ki 1.8±n/a nM
Citation Beattie, DBradley, MBrearley, ACharlton, SJCuenoud, BMFairhurst, RAGedeck, PGosling, MJanus, DJones, DLewis, CMcCarthy, COakman, HStringer, RTaylor, RJTuffnell, A A physical properties based approach for the exploration of a 4-hydroxybenzothiazolone series of beta2-adrenoceptor agonists as inhaled long-acting bronchodilators. Bioorg Med Chem Lett20:5302-7 (2010) 
 
Beta-2 adrenergic receptor
Name:Beta-2 adrenergic receptor
Type:n/a
Mol. Mass.:46461.69
Organism:Homo sapiens (Human)
Description:P07550
Residue:413
BDBM50324844
NameBDBM50324844
Synonyms:(R)-4-hydroxy-7-(1-hydroxy-2-(phenethylamino)ethyl)benzo[d]thiazol-2(3H)-one | CHEMBL1221587
TypeSmall organic molecule
Emp. Form.C17H18N2O3S
Mol. Mass.330.401
SMILESO[C@@H](CNCCc1ccccc1)c1ccc(O)c2[nH]c(=O)sc12