Reaction Details
TargetBeta-2 adrenergic receptor
LigandBDBM50324834
Substrate/Competitorn/a
Meas. Tech.ChEMBL_651475 (CHEMBL1227592)
Ki 4.4±n/a nM
Citation Beattie, DBradley, MBrearley, ACharlton, SJCuenoud, BMFairhurst, RAGedeck, PGosling, MJanus, DJones, DLewis, CMcCarthy, COakman, HStringer, RTaylor, RJTuffnell, A A physical properties based approach for the exploration of a 4-hydroxybenzothiazolone series of beta2-adrenoceptor agonists as inhaled long-acting bronchodilators. Bioorg Med Chem Lett20:5302-7 (2010) 
 
Beta-2 adrenergic receptor
Name:Beta-2 adrenergic receptor
Type:n/a
Mol. Mass.:46461.69
Organism:Homo sapiens (Human)
Description:P07550
Residue:413
BDBM50324834
NameBDBM50324834
Synonyms:(R)-4-hydroxy-7-(1-hydroxy-2-(2-phenoxyethylamino)ethyl)benzo[d]thiazol-2(3H)-one | CHEMBL1221803
TypeSmall organic molecule
Emp. Form.C17H18N2O4S
Mol. Mass.346.401
SMILESO[C@@H](CNCCOc1ccccc1)c1ccc(O)c2[nH]c(=O)sc12