Reaction Details
TargetBeta-2 adrenergic receptor
LigandBDBM50324837
Substrate/Competitorn/a
Meas. Tech.ChEMBL_651475 (CHEMBL1227592)
Ki 3±n/a nM
Citation Beattie, DBradley, MBrearley, ACharlton, SJCuenoud, BMFairhurst, RAGedeck, PGosling, MJanus, DJones, DLewis, CMcCarthy, COakman, HStringer, RTaylor, RJTuffnell, A A physical properties based approach for the exploration of a 4-hydroxybenzothiazolone series of beta2-adrenoceptor agonists as inhaled long-acting bronchodilators. Bioorg Med Chem Lett20:5302-7 (2010) 
 
Beta-2 adrenergic receptor
Name:Beta-2 adrenergic receptor
Type:n/a
Mol. Mass.:46461.69
Organism:Homo sapiens (Human)
Description:P07550
Residue:413
BDBM50324837
NameBDBM50324837
Synonyms:(R)-7-(2-(2-(4-chlorophenylthio)ethylamino)-1-hydroxyethyl)-4-hydroxybenzo[d]thiazol-2(3H)-one | CHEMBL1221861
TypeSmall organic molecule
Emp. Form.C17H17ClN2O3S2
Mol. Mass.396.911
SMILESO[C@@H](CNCCSc1ccc(Cl)cc1)c1ccc(O)c2[nH]c(=O)sc12