Reaction Details
TargetBeta-1 adrenergic receptor
LigandBDBM50324831
Substrate/Competitorn/a
Meas. Tech.ChEMBL_651476 (CHEMBL1227593)
Ki 123±n/a nM
Citation Beattie, DBradley, MBrearley, ACharlton, SJCuenoud, BMFairhurst, RAGedeck, PGosling, MJanus, DJones, DLewis, CMcCarthy, COakman, HStringer, RTaylor, RJTuffnell, A A physical properties based approach for the exploration of a 4-hydroxybenzothiazolone series of beta2-adrenoceptor agonists as inhaled long-acting bronchodilators. Bioorg Med Chem Lett20:5302-7 (2010) 
 
Beta-1 adrenergic receptor
Name:Beta-1 adrenergic receptor
Type:G Protein-Coupled Receptor (GPCR)
Mol. Mass.:51338.40
Organism:Homo sapiens (Human)
Description:P08588
Residue:477
BDBM50324831
NameBDBM50324831
Synonyms:(R)-7-(2-(2-cyclohexylcyclopentylamino)-1-hydroxyethyl)-4-hydroxybenzo[d]thiazol-2(3H)-one | CHEMBL1221736
TypeSmall organic molecule
Emp. Form.C20H28N2O3S
Mol. Mass.376.513
SMILESO[C@@H](CNC1CCCC1C1CCCCC1)c1ccc(O)c2[nH]c(=O)sc12