Reaction Details
TargetAcetylcholinesterase
LigandBDBM50293601
Substrate/Competitorn/a
Meas. Tech.ChEMBL_651480 (CHEMBL1227597)
Ki 340±n/a nM
Citation McNulty, JNair, JJLittle, JRBrennan, JDBastida, J Structure-activity studies on acetylcholinesterase inhibition in the lycorine series of Amaryllidaceae alkaloids. Bioorg Med Chem Lett20:5290-4 (2010) 
 
Acetylcholinesterase
Name:Acetylcholinesterase
Type:Enzyme
Mol. Mass.:67792.70
Organism:Homo sapiens (Human)
Description:P22303
Residue:614
BDBM50293601
NameBDBM50293601
Synonyms:(1S,2S,3a1S,12bS)-2-(tert-butyldimethylsilyloxy)-2,3a1,4,5,7,12b-hexahydro-1H-[1,3]dioxolo[4,5-j]pyrrolo[3,2,1-de]phenanthridin-1-yl acetate CHEMBL564408
TypeSmall organic molecule
Emp. Form.C24H33NO5Si
Mol. Mass.443.608
SMILESCC(=O)O[C@@H]1[C@@H](O[Si](C)(C)C(C)(C)C)C=C2CCN3Cc4cc5OCOc5cc4[C@H]1[C@@H]23