Reaction Details
TargetCaspase-1
LigandBDBM10355
Substrate/Competitorn/a
Meas. Tech.ChEMBL_651545 (CHEMBL1227797)
IC50 17±n/a nM
Citation Galatsis, PCaprathe, BGilmore, JThomas, ALinn, KSheehan, SHarter, WKostlan, CLunney, EStankovic, CRubin, JBrady, KAllen, HTalanian, R Succinic acid amides as P2-P3 replacements for inhibitors of interleukin-1beta converting enzyme (ICE or caspase 1). Bioorg Med Chem Lett20:5184-90 (2010) 
 
Caspase-1
Name:Caspase-1
Type:Enzyme
Mol. Mass.:45154.13
Organism:Homo sapiens (Human)
Description:P29466
Residue:404
BDBM10355
NameBDBM10355
Synonyms:(3S)-3-[(2S)-2-[(2S)-2-[(2S)-2-acetamido-3-(4-hydroxyphenyl)propanamido]-3-methylbutanamido]propanamido]-4-oxobutanoic acid CHEMBL37630
TypeSmall organic molecule
Emp. Form.C23H32N4O8
Mol. Mass.492.5222
SMILESCC(C)[C@H](NC(=O)[C@H](Cc1ccc(O)cc1)NC(C)=O)C(=O)N[C@@H](C)C(=O)N[C@@H](CC(O)=O)C=O