Reaction Details
TargetCaspase-1
LigandBDBM50324951
Substrate/Competitorn/a
Meas. Tech.ChEMBL_651545 (CHEMBL1227797)
Ki 1020±n/a nM
Citation Galatsis, PCaprathe, BGilmore, JThomas, ALinn, KSheehan, SHarter, WKostlan, CLunney, EStankovic, CRubin, JBrady, KAllen, HTalanian, R Succinic acid amides as P2-P3 replacements for inhibitors of interleukin-1beta converting enzyme (ICE or caspase 1). Bioorg Med Chem Lett20:5184-90 (2010) 
 
Caspase-1
Name:Caspase-1
Type:Enzyme
Mol. Mass.:45154.13
Organism:Homo sapiens (Human)
Description:P29466
Residue:404
BDBM50324951
NameBDBM50324951
Synonyms:(R)-2-((S)-2-isopropyl-4-oxo-4-(4-phenylpiperazin-1-yl)butanamido)-3-oxopropanoic acid | CHEMBL1221596
TypeSmall organic molecule
Emp. Form.C21H29N3O5
Mol. Mass.403.4721
SMILESCC(C)[C@H](CC(=O)N1CCN(CC1)c1ccccc1)C(=O)N[C@@H](CC(O)=O)C=O