Reaction Details
TargetAdenosine receptor A2a
LigandBDBM50324969
Substrate/Competitorn/a
Meas. Tech.ChEMBL_651582 (CHEMBL1227965)
Ki 190±n/a nM
Citation Sams, AGMikkelsen, GKLarsen, MTorup, LBrennum, LTSchrøder, TJBang-Andersen, B Hit-to-lead optimization of a series of carboxamides of ethyl 2-amino-4-phenylthiazole-5-carboxylates as novel adenosine A2A receptor antagonists. Bioorg Med Chem Lett20:5241-4 (2010) 
 
Adenosine receptor A2a
Name:Adenosine receptor A2a
Type:G Protein-Coupled Receptor (GPCR)
Mol. Mass.:44716.46
Organism:Homo sapiens (Human)
Description:P29274
Residue:412
BDBM50324969
NameBDBM50324969
Synonyms:CHEMBL1222242 | Furan-2-carboxylic acid(5-ethoxymethyl-4-phenyl-thiazol-2-yl)-amide
TypeSmall organic molecule
Emp. Form.C17H16N2O3S
Mol. Mass.328.386
SMILESCCOCc1sc(NC(=O)c2ccco2)nc1-c1ccccc1