Reaction Details
TargetAdenosine receptor A2a
LigandBDBM50324978
Substrate/Competitorn/a
Meas. Tech.ChEMBL_651582 (CHEMBL1227965)
Ki 340±n/a nM
Citation Sams, AGMikkelsen, GKLarsen, MTorup, LBrennum, LTSchrøder, TJBang-Andersen, B Hit-to-lead optimization of a series of carboxamides of ethyl 2-amino-4-phenylthiazole-5-carboxylates as novel adenosine A2A receptor antagonists. Bioorg Med Chem Lett20:5241-4 (2010) 
 
Adenosine receptor A2a
Name:Adenosine receptor A2a
Type:G Protein-Coupled Receptor (GPCR)
Mol. Mass.:44716.46
Organism:Homo sapiens (Human)
Description:P29274
Residue:412
BDBM50324978
NameBDBM50324978
Synonyms:3-Methyl-N-(5-[1,2,4]oxadiazol-3-yl-4-phenyl-thiazol-2-yl)-butyramide | CHEMBL1222371
TypeSmall organic molecule
Emp. Form.C16H16N4O2S
Mol. Mass.328.389
SMILESCC(C)CC(=O)Nc1nc(c(s1)-c1ncon1)-c1ccccc1