Reaction Details
TargetAdenosine receptor A1
LigandBDBM50324976
Substrate/Competitorn/a
Meas. Tech.ChEMBL_651580 (CHEMBL1227963)
Ki 230±n/a nM
Citation Sams, AGMikkelsen, GKLarsen, MTorup, LBrennum, LTSchrøder, TJBang-Andersen, B Hit-to-lead optimization of a series of carboxamides of ethyl 2-amino-4-phenylthiazole-5-carboxylates as novel adenosine A2A receptor antagonists. Bioorg Med Chem Lett20:5241-4 (2010) 
 
Adenosine receptor A1
Name:Adenosine receptor A1
Type:G Protein-Coupled Receptor (GPCR)
Mol. Mass.:36520.92
Organism:Homo sapiens (Human)
Description:P30542
Residue:326
BDBM50324976
NameBDBM50324976
Synonyms:CHEMBL1222369 | Furan-2-carboxylic acid(5-[1,2,4]oxadiazol-3-yl-4-phenyl-thiazol-2-yl)-amide
TypeSmall organic molecule
Emp. Form.C16H10N4O3S
Mol. Mass.338.341
SMILESO=C(Nc1nc(c(s1)-c1ncon1)-c1ccccc1)c1ccco1