Reaction Details
TargetAdenosine receptor A1
LigandBDBM50324990
Substrate/Competitorn/a
Meas. Tech.ChEMBL_651580 (CHEMBL1227963)
Ki 1200±n/a nM
Citation Sams, AGMikkelsen, GKLarsen, MTorup, LBrennum, LTSchrøder, TJBang-Andersen, B Hit-to-lead optimization of a series of carboxamides of ethyl 2-amino-4-phenylthiazole-5-carboxylates as novel adenosine A2A receptor antagonists. Bioorg Med Chem Lett20:5241-4 (2010) 
 
Adenosine receptor A1
Name:Adenosine receptor A1
Type:G Protein-Coupled Receptor (GPCR)
Mol. Mass.:36520.92
Organism:Homo sapiens (Human)
Description:P30542
Residue:326
BDBM50324990
NameBDBM50324990
Synonyms:CHEMBL1221508 | N-[5-(2-Ethyl-2H-tetrazol-5-yl)-4-phenyl-thiazol-2-yl]-2-phenyl-acetamide
TypeSmall organic molecule
Emp. Form.C20H18N6OS
Mol. Mass.390.462
SMILESCCn1nnc(n1)-c1sc(NC(=O)Cc2ccccc2)nc1-c1ccccc1