Reaction Details
TargetAdenosine receptor A1
LigandBDBM50324991
Substrate/Competitorn/a
Meas. Tech.ChEMBL_651580 (CHEMBL1227963)
Ki 1600±n/a nM
Citation Sams, AGMikkelsen, GKLarsen, MTorup, LBrennum, LTSchrøder, TJBang-Andersen, B Hit-to-lead optimization of a series of carboxamides of ethyl 2-amino-4-phenylthiazole-5-carboxylates as novel adenosine A2A receptor antagonists. Bioorg Med Chem Lett20:5241-4 (2010) 
 
Adenosine receptor A1
Name:Adenosine receptor A1
Type:G Protein-Coupled Receptor (GPCR)
Mol. Mass.:36520.92
Organism:Homo sapiens (Human)
Description:P30542
Residue:326
BDBM50324991
NameBDBM50324991
Synonyms:2-(3,4-Dimethoxy-phenyl)-N-[5-(2-ethyl-2H-tetrazol-5-yl)-4-phenyl-thiazol-2-yl]-acetamide | CHEMBL1222587
TypeSmall organic molecule
Emp. Form.C22H22N6O3S
Mol. Mass.450.513
SMILESCCn1nnc(n1)-c1sc(NC(=O)Cc2ccc(OC)c(OC)c2)nc1-c1ccccc1