Reaction Details
TargetCannabinoid receptor 1
LigandBDBM50325035
Substrate/Competitorn/a
Meas. Tech.ChEMBL_651609 (CHEMBL1227992)
IC50 125±n/a nM
Citation Lee, GNKim, KRAhn, SHBae, MAKang, NS Discovery of cannabinoid-1 receptor antagonists by virtual screening. Bioorg Med Chem Lett20:5130-2 (2010) 
 
Cannabinoid receptor 1
Name:Cannabinoid receptor 1
Type:G Protein-Coupled Receptor (GPCR)
Mol. Mass.:52868.96
Organism:Homo sapiens (Human)
Description:P21554
Residue:472
BDBM50325035
NameBDBM50325035
Synonyms:5-(pyridin-3-ylmethylene)-2-(3-(trifluoromethyl)phenylamino)thiazol-4(5H)-one | CHEMBL1223233
TypeSmall organic molecule
Emp. Form.C16H10F3N3OS
Mol. Mass.349.33
SMILESFC(F)(F)c1cccc(NC2=NC(=O)C(S2)=Cc2cccnc2)c1