Reaction Details
TargetHistamine H3 receptor
LigandBDBM50325040
Substrate/Competitorn/a
Meas. Tech.ChEMBL_651627 (CHEMBL1228010)
IC50 900±n/a nM
Citation Davenport, AJStimson, CCCorsi, MVaidya, DGlenn, EJones, TDBailey, SGemkow, MJFritz, UHallett, DJ Discovery of substituted benzyl tetrazoles as histamine H3 receptor antagonists. Bioorg Med Chem Lett20:5165-9 (2010) 
 
Histamine H3 receptor
Name:Histamine H3 receptor
Type:G Protein-Coupled Receptor (GPCR)
Mol. Mass.:48691.47
Organism:Homo sapiens (Human)
Description:Binding assays were using CHO cells stably expressing hH3R receptors.
Residue:445
BDBM50325040
NameBDBM50325040
Synonyms:1-((1-benzyl-1H-tetrazol-5-yl)(phenyl)methyl)-4-methylpiperazine | CHEMBL1222728
TypeSmall organic molecule
Emp. Form.C20H24N6
Mol. Mass.348.4448
SMILESCN1CCN(CC1)C(c1nnnn1Cc1ccccc1)c1ccccc1