Reaction Details
TargetHistamine H3 receptor
LigandBDBM50325043
Substrate/Competitorn/a
Meas. Tech.ChEMBL_651627 (CHEMBL1228010)
IC50 2742±n/a nM
Citation Davenport, AJStimson, CCCorsi, MVaidya, DGlenn, EJones, TDBailey, SGemkow, MJFritz, UHallett, DJ Discovery of substituted benzyl tetrazoles as histamine H3 receptor antagonists. Bioorg Med Chem Lett20:5165-9 (2010) 
 
Histamine H3 receptor
Name:Histamine H3 receptor
Type:G Protein-Coupled Receptor (GPCR)
Mol. Mass.:48691.47
Organism:Homo sapiens (Human)
Description:Binding assays were using CHO cells stably expressing hH3R receptors.
Residue:445
BDBM50325043
NameBDBM50325043
Synonyms:CHEMBL1222807 | N1-((1-benzyl-1H-tetrazol-5-yl)(4-fluorophenyl)methyl)-N1,N2,N2-trimethylethane-1,2-diamine
TypeSmall organic molecule
Emp. Form.C20H25FN6
Mol. Mass.368.4511
SMILESCN(C)CCN(C)C(c1nnnn1Cc1ccccc1)c1ccc(F)cc1