Reaction Details
TargetHistamine H3 receptor
LigandBDBM50325063
Substrate/Competitorn/a
Meas. Tech.ChEMBL_651628 (CHEMBL1228011)
IC50 12±n/a nM
Citation Davenport, AJStimson, CCCorsi, MVaidya, DGlenn, EJones, TDBailey, SGemkow, MJFritz, UHallett, DJ Discovery of substituted benzyl tetrazoles as histamine H3 receptor antagonists. Bioorg Med Chem Lett20:5165-9 (2010) 
 
Histamine H3 receptor
Name:Histamine H3 receptor
Type:G Protein-Coupled Receptor (GPCR)
Mol. Mass.:48607.98
Organism:Rattus norvegicus (rat)
Description:n/a
Residue:445
BDBM50325063
NameBDBM50325063
Synonyms:4-((1-benzyl-1H-tetrazol-5-yl)(4-cyclobutyl-1,4-diazepan-1-yl)methyl)-N-methylbenzamide | CHEMBL1221429
TypeSmall organic molecule
Emp. Form.C26H33N7O
Mol. Mass.459.5865
SMILESCNC(=O)c1ccc(cc1)C(N1CCCN(CC1)C1CCC1)c1nnnn1Cc1ccccc1