Reaction Details
TargetCytochrome P450 2D6
LigandBDBM50325064
Substrate/Competitorn/a
Meas. Tech.ChEMBL_651639 (CHEMBL1228177)
IC50>50000±n/a nM
Citation Davenport, AJStimson, CCCorsi, MVaidya, DGlenn, EJones, TDBailey, SGemkow, MJFritz, UHallett, DJ Discovery of substituted benzyl tetrazoles as histamine H3 receptor antagonists. Bioorg Med Chem Lett20:5165-9 (2010) 
 
Cytochrome P450 2D6
Name:Cytochrome P450 2D6
Type:Protein
Mol. Mass.:55774.82
Organism:Homo sapiens (Human)
Description:P10635
Residue:497
BDBM50325064
NameBDBM50325064
Synonyms:1-((1-benzyl-1H-tetrazol-5-yl)(4-(methylsulfonyl)phenyl)methyl)-4-cyclobutyl-1,4-diazepane | CHEMBL1223157
TypeSmall organic molecule
Emp. Form.C25H32N6O2S
Mol. Mass.480.626
SMILESCS(=O)(=O)c1ccc(cc1)C(N1CCCN(CC1)C1CCC1)c1nnnn1Cc1ccccc1