Reaction Details
TargetCytochrome P450 2D6
LigandBDBM50325068
Substrate/Competitorn/a
Meas. Tech.ChEMBL_651639 (CHEMBL1228177)
IC50 1000±n/a nM
Citation Davenport, AJStimson, CCCorsi, MVaidya, DGlenn, EJones, TDBailey, SGemkow, MJFritz, UHallett, DJ Discovery of substituted benzyl tetrazoles as histamine H3 receptor antagonists. Bioorg Med Chem Lett20:5165-9 (2010) 
 
Cytochrome P450 2D6
Name:Cytochrome P450 2D6
Type:Protein
Mol. Mass.:55774.82
Organism:Homo sapiens (Human)
Description:P10635
Residue:497
BDBM50325068
NameBDBM50325068
Synonyms:1-(benzofuran-5-yl(1-benzyl-1H-tetrazol-5-yl)methyl)-4-cyclobutyl-1,4-diazepane | CHEMBL1223237
TypeSmall organic molecule
Emp. Form.C26H30N6O
Mol. Mass.442.556
SMILESC(c1ccccc1)n1nnnc1C(N1CCCN(CC1)C1CCC1)c1ccc2occc2c1