Reaction Details
TargetCytochrome P450 3A4
LigandBDBM50325068
Substrate/Competitorn/a
Meas. Tech.ChEMBL_651640 (CHEMBL1228178)
IC50 2400±n/a nM
Citation Davenport, AJStimson, CCCorsi, MVaidya, DGlenn, EJones, TDBailey, SGemkow, MJFritz, UHallett, DJ Discovery of substituted benzyl tetrazoles as histamine H3 receptor antagonists. Bioorg Med Chem Lett20:5165-9 (2010) 
 
Cytochrome P450 3A4
Name:Cytochrome P450 3A4
Type:Enzyme
Mol. Mass.:57349.57
Organism:Homo sapiens (Human)
Description:n/a
Residue:503
BDBM50325068
NameBDBM50325068
Synonyms:1-(benzofuran-5-yl(1-benzyl-1H-tetrazol-5-yl)methyl)-4-cyclobutyl-1,4-diazepane | CHEMBL1223237
TypeSmall organic molecule
Emp. Form.C26H30N6O
Mol. Mass.442.556
SMILESC(c1ccccc1)n1nnnc1C(N1CCCN(CC1)C1CCC1)c1ccc2occc2c1