Reaction Details
TargetHistamine H3 receptor
LigandBDBM50325072
Substrate/Competitorn/a
Meas. Tech.ChEMBL_651627 (CHEMBL1228010)
IC50 58±n/a nM
Citation Davenport, AJStimson, CCCorsi, MVaidya, DGlenn, EJones, TDBailey, SGemkow, MJFritz, UHallett, DJ Discovery of substituted benzyl tetrazoles as histamine H3 receptor antagonists. Bioorg Med Chem Lett20:5165-9 (2010) 
 
Histamine H3 receptor
Name:Histamine H3 receptor
Type:G Protein-Coupled Receptor (GPCR)
Mol. Mass.:48691.47
Organism:Homo sapiens (Human)
Description:Binding assays were using CHO cells stably expressing hH3R receptors.
Residue:445
BDBM50325072
NameBDBM50325072
Synonyms:1-((1-benzyl-1H-tetrazol-5-yl)(3-(difluoromethoxy)phenyl)methyl)-4-cyclobutyl-1,4-diazepane | CHEMBL1223310
TypeSmall organic molecule
Emp. Form.C25H30F2N6O
Mol. Mass.468.5421
SMILESFC(F)Oc1cccc(c1)C(N1CCCN(CC1)C1CCC1)c1nnnn1Cc1ccccc1