Reaction Details
TargetHistamine H3 receptor
LigandBDBM50325097
Substrate/Competitorn/a
Meas. Tech.ChEMBL_651627 (CHEMBL1228010)
IC50 12±n/a nM
Citation Davenport, AJStimson, CCCorsi, MVaidya, DGlenn, EJones, TDBailey, SGemkow, MJFritz, UHallett, DJ Discovery of substituted benzyl tetrazoles as histamine H3 receptor antagonists. Bioorg Med Chem Lett20:5165-9 (2010) 
 
Histamine H3 receptor
Name:Histamine H3 receptor
Type:G Protein-Coupled Receptor (GPCR)
Mol. Mass.:48691.47
Organism:Homo sapiens (Human)
Description:Binding assays were using CHO cells stably expressing hH3R receptors.
Residue:445
BDBM50325097
NameBDBM50325097
Synonyms:1-((1-benzyl-1H-tetrazol-5-yl)(4-(pyrimidin-2-yloxy)phenyl)methyl)-4-cyclobutyl-1,4-diazepane | CHEMBL1222596
TypeSmall organic molecule
Emp. Form.C28H32N8O
Mol. Mass.496.6067
SMILESC(c1ccccc1)n1nnnc1C(N1CCCN(CC1)C1CCC1)c1ccc(Oc2ncccn2)cc1