Reaction Details
TargetCaspase-1
LigandBDBM50325237
Substrate/Competitorn/a
Meas. Tech.ChEMBL_651931 (CHEMBL1227461)
Ki 1±n/a nM
Citation Galatsis, PCaprathe, BDowning, DGilmore, JHarter, WHays, SKostlan, CLinn, KLunney, EPara, KThomas, AWarmus, JAllen, HBrady, KTalanian, RWalker, N Inhibition of interleukin-1beta converting enzyme (ICE or caspase 1) by aspartyl acyloxyalkyl ketones and aspartyl amidooxyalkyl ketones. Bioorg Med Chem Lett20:5089-94 (2010) 
 
Caspase-1
Name:Caspase-1
Type:Enzyme
Mol. Mass.:45154.13
Organism:Homo sapiens (Human)
Description:P29466
Residue:404
BDBM50325237
NameBDBM50325237
Synonyms:(5S,8S,11S)-11-(2-(3,3-diphenylpropanoyloxy)acetyl)-5-isopropyl-8-methyl-3,6,9-trioxo-1-phenyl-2-oxa-4,7,10-triazatridecan-13-oic acid | CHEMBL1223110
TypeSmall organic molecule
Emp. Form.C36H41N3O9
Mol. Mass.659.7254
SMILESCC(C)[C@H](NC(=O)OCc1ccccc1)C(=O)N[C@@H](C)C(=O)N[C@@H](CC(O)=O)C(=O)COC(=O)CC(c1ccccc1)c1ccccc1