Reaction Details
TargetSteroid 17-alpha-hydroxylase/17,20 lyase
LigandBDBM7887
Substrate/Competitorn/a
Meas. Tech.ChEMBL_652121 (CHEMBL1228230)
IC50>3000±n/a nM
Citation Owen, CPShahid, ILee, WYAhmed, S Synthesis and biochemical evaluation of a range of (4-substituted phenyl)sulfonate derivatives of 4-hydroxybenzyl imidazole-based compounds as potent inhibitors of 17alpha-hydroxylase/17,20-lyase (P45017alpha) derived from rat testicular microsomes. Bioorg Med Chem Lett20:5345-8 (2010) 
 
Steroid 17-alpha-hydroxylase/17,20 lyase
Name:Steroid 17-alpha-hydroxylase/17,20 lyase
Type:Enzyme
Mol. Mass.:57255.68
Organism:Rattus norvegicus (Rat)
Description:P11715
Residue:507
BDBM7887
NameBDBM7887
Synonyms:1-Benzylimidazole (BI) 1-benzylimidazole US9138393, 1-benzylimidazole
TypeSmall organic molecule
Emp. Form.C10H10N2
Mol. Mass.158.1998
SMILESC(c1ccccc1)n1ccnc1