Reaction Details
TargetSteroid 17-alpha-hydroxylase/17,20 lyase
LigandBDBM31768
Substrate/Competitorn/a
Meas. Tech.ChEMBL_652120 (CHEMBL1228229)
IC50 206±n/a nM
Citation Owen, CPShahid, ILee, WYAhmed, S Synthesis and biochemical evaluation of a range of (4-substituted phenyl)sulfonate derivatives of 4-hydroxybenzyl imidazole-based compounds as potent inhibitors of 17alpha-hydroxylase/17,20-lyase (P45017alpha) derived from rat testicular microsomes. Bioorg Med Chem Lett20:5345-8 (2010) 
 
Steroid 17-alpha-hydroxylase/17,20 lyase
Name:Steroid 17-alpha-hydroxylase/17,20 lyase
Type:Enzyme
Mol. Mass.:57255.68
Organism:Rattus norvegicus (Rat)
Description:P11715
Residue:507
BDBM31768
NameBDBM31768
Synonyms:CHEMBL295698 Nizoral | Panfungol
TypeSmall organic molecule
Emp. Form.C26H28Cl2N4O4
Mol. Mass.531.431
SMILESCC(=O)N1CCN(CC1)c1ccc(OC[C@@H]2CO[C@](Cn3ccnc3)(O2)c2ccc(Cl)cc2Cl)cc1