Reaction Details
TargetCollagenase 3
LigandBDBM50325341
Substrate/Competitorn/a
Meas. Tech.ChEMBL_652122 (CHEMBL1228231)
IC50 7±n/a nM
Citation Gao, DAXiong, ZHeim-Riether, AAmodeo, LAugust, EMCao, XCiccarelli, LCollins, BKHarrington, KHaverty, KHill-Drzewi, MLi, XLiang, SMargarit, SMMoss, NNagaraja, NProudfoot, JRoman, RSchlyer, SKeenan, LSTaylor, SWellenzohn, BWiedenmayer, DLi, JFarrow, NA SAR studies of non-zinc-chelating MMP-13 inhibitors: improving selectivity and metabolic stability. Bioorg Med Chem Lett20:5039-43 (2010) 
 
Collagenase 3
Name:Collagenase 3
Type:Enzyme
Mol. Mass.:53808.06
Organism:Homo sapiens (Human)
Description:P45452
Residue:471
BDBM50325341
NameBDBM50325341
Synonyms:(R)-N-(3-(5-(1-cyclohexyl-2-(methylamino)-2-oxoethylcarbamoyl)furan-2-yl)benzyl)-2-(trifluoromethyl)pyrimidine-4-carboxamide | CHEMBL1223421
TypeSmall organic molecule
Emp. Form.C27H28F3N5O4
Mol. Mass.543.5375
SMILESCNC(=O)[C@H](NC(=O)c1ccc(o1)-c1cccc(CNC(=O)c2ccnc(n2)C(F)(F)F)c1)C1CCCCC1