Reaction Details
TargetCollagenase 3
LigandBDBM50325352
Substrate/Competitorn/a
Meas. Tech.ChEMBL_652122 (CHEMBL1228231)
IC50 8±n/a nM
Citation Gao, DAXiong, ZHeim-Riether, AAmodeo, LAugust, EMCao, XCiccarelli, LCollins, BKHarrington, KHaverty, KHill-Drzewi, MLi, XLiang, SMargarit, SMMoss, NNagaraja, NProudfoot, JRoman, RSchlyer, SKeenan, LSTaylor, SWellenzohn, BWiedenmayer, DLi, JFarrow, NA SAR studies of non-zinc-chelating MMP-13 inhibitors: improving selectivity and metabolic stability. Bioorg Med Chem Lett20:5039-43 (2010) 
 
Collagenase 3
Name:Collagenase 3
Type:Enzyme
Mol. Mass.:53808.06
Organism:Homo sapiens (Human)
Description:P45452
Residue:471
BDBM50325352
NameBDBM50325352
Synonyms:(R)-N-(3-(5-(1-cyclohexyl-2-(methylamino)-2-oxoethylcarbamoyl)furan-2-yl)benzyl)-2-methylthiazole-4-carboxamide | CHEMBL1223201
TypeSmall organic molecule
Emp. Form.C26H30N4O4S
Mol. Mass.494.606
SMILESCNC(=O)[C@H](NC(=O)c1ccc(o1)-c1cccc(CNC(=O)c2csc(C)n2)c1)C1CCCCC1