Reaction Details
TargetInsulin-like growth factor 1 receptor
LigandBDBM50325425
Substrate/Competitorn/a
Meas. Tech.ChEMBL_652151 (CHEMBL1228260)
IC50 7±n/a nM
Citation Sampognaro, AJWittman, MDCarboni, JMChang, CGreer, AFHurlburt, WWSack, JSVyas, DM Proline isosteres in a series of 2,4-disubstituted pyrrolo[1,2-f][1,2,4]triazine inhibitors of IGF-1R kinase and IR kinase. Bioorg Med Chem Lett20:5027-30 (2010) 
 
Insulin-like growth factor 1 receptor
Name:Insulin-like growth factor 1 receptor
Type:Protein
Mol. Mass.:154776.79
Organism:Homo sapiens (Human)
Description:P08069
Residue:1367
BDBM50325425
NameBDBM50325425
Synonyms:(S)-(2-(4-(5-cyclopropyl-1H-pyrazol-3-ylamino)pyrrolo[1,2-f][1,2,4]triazin-2-yl)pyrrolidin-1-yl)(6-fluoropyridin-3-yl)methanone N-(5-cyclopropyl-1H-pyrazol-3-yl)-2-{(2S)-1-[(6-fluoropyridin-3-yl)carbonyl]pyrrolidin-2-yl}pyrrolo[2,1-f][1,2,4]triazin-4-amine
TypeSmall organic molecule
Emp. Form.C22H21FN8O
Mol. Mass.432.4535
SMILESFc1ccc(cn1)C(=O)N1CCC[C@H]1c1nc(Nc2cc(n[nH]2)C2CC2)c2cccn2n1