Reaction Details
TargetHistamine H3 receptor
LigandBDBM50325463
Substrate/Competitorn/a
Meas. Tech.ChEMBL_652205 (CHEMBL1228478)
Ki 2±n/a nM
Citation Ting, PCLee, JFAlbanese, MMWu, JAslanian, RFavreau, LNardo, CKorfmacher, WAWest, REWilliams, SMAnthes, JCRivelli, MACorboz, MRHey, JA The synthesis and structure-activity relationship of 4-benzimidazolyl-piperidinylcarbonyl-piperidine analogs as histamine H3 antagonists. Bioorg Med Chem Lett20:5004-8 (2010) 
 
Histamine H3 receptor
Name:Histamine H3 receptor
Type:Enzyme Catalytic Domain
Mol. Mass.:48753.61
Organism:GUINEA PIG
Description:HISTAMINE H3 HRH3 GUINEA PIG::Q9JI35
Residue:445
BDBM50325463
NameBDBM50325463
Synonyms:1-(3-chlorobenzyl)-3-(1-(1-(pyridin-4-ylmethyl)piperidine-4-carbonyl)piperidin-4-yl)-1H-benzo[d]imidazol-2(3H)-one | CHEMBL1222940
TypeSmall organic molecule
Emp. Form.C31H34ClN5O2
Mol. Mass.544.087
SMILESClc1cccc(Cn2c3ccccc3n(C3CCN(CC3)C(=O)C3CCN(Cc4ccncc4)CC3)c2=O)c1