Reaction Details
TargetHistamine H3 receptor
LigandBDBM50325472
Substrate/Competitorn/a
Meas. Tech.ChEMBL_652205 (CHEMBL1228478)
Ki 0.95±n/a nM
Citation Ting, PCLee, JFAlbanese, MMWu, JAslanian, RFavreau, LNardo, CKorfmacher, WAWest, REWilliams, SMAnthes, JCRivelli, MACorboz, MRHey, JA The synthesis and structure-activity relationship of 4-benzimidazolyl-piperidinylcarbonyl-piperidine analogs as histamine H3 antagonists. Bioorg Med Chem Lett20:5004-8 (2010) 
 
Histamine H3 receptor
Name:Histamine H3 receptor
Type:Enzyme Catalytic Domain
Mol. Mass.:48753.61
Organism:GUINEA PIG
Description:HISTAMINE H3 HRH3 GUINEA PIG::Q9JI35
Residue:445
BDBM50325472
NameBDBM50325472
Synonyms:1-(2-hydroxyethyl)-3-(1-(1-(pyridin-4-ylmethyl)piperidine-4-carbonyl)piperidin-4-yl)-1H-benzo[d]imidazol-2(3H)-one | CHEMBL1222651
TypeSmall organic molecule
Emp. Form.C26H33N5O3
Mol. Mass.463.5719
SMILESOCCn1c2ccccc2n(C2CCN(CC2)C(=O)C2CCN(Cc3ccncc3)CC2)c1=O